2-Pentene, 4-methyl-2,4-diphenyl-

Normal alkane RI, non-polar column, temperature ramp

Data compiled by: NIST Mass Spectrometry Data Center, William E. Wallace, director

Column type Capillary
Active phase HP-1
Column length (m) 30.
Carrier gas He
Substrate
Column diameter (mm) 0.25
Phase thickness (μm) 0.1
Tstart (C) 50.
Tend (C) 300.
Heat rate (K/min) 5.
Initial hold (min) 2.
Final hold (min) 3.
I 1826.
ReferenceBoatright and Crum, 1997
Comment MSDC-RI

References

Boatright and Crum, 1997
Boatright, W.L.; Crum, A.D., Nonpolar-volatile lipids from soy protein isolates and hexane-defatted flakes, J. Amer. Oil Chem. Soc., 1997, 74, 4, 461-467, https://doi.org/10.1007/s11746-997-0107-z . [all data]