α-Aminoisobutanoic acid

Condensed phase thermochemistry data

Data compiled by: Hussein Y. Afeefy, Joel F. Liebman, and Stephen E. Stein

Quantity Value Units Method Reference Comment
Δfsolid-594.28 ± 0.48kJ/molCcbSteele, Chirico, et al., 1997
Δfsolid-527. ± 2.0kJ/molCcbContineanu and Marchidan, 1994
Quantity Value Units Method Reference Comment
Δcsolid-2265.99 ± 0.42kJ/molCcbSteele, Chirico, et al., 1997
Δcsolid-2330. ± 2.0kJ/molCcbContineanu and Marchidan, 1994

Phase change data

Data compiled by: William E. Acree, Jr., James S. Chickos

Enthalpy of sublimation

ΔsubH (kJ/mol) Temperature (K) Method Reference Comment
125.8450.5AStephenson and Malanowski, 1987Based on data from 439. - 462. K.
134.2413.5AStephenson and Malanowski, 1987Based on data from 403. - 424. K.
129.5 ± 0.4455.MESvec and Clyde, 1965See also Clyde and Svec, 1964.

References

Steele, Chirico, et al., 1997
Steele, W.V.; Chirico, R.D.; Cowell, A.B.; Knipmeyer, S.E.; Nguyen, A., Thermodynamic properties and ideal-gas enthalpies of formation for 2-aminoisobutyric acid (2-methylalanine), acetic acid, (4-methyl-3-penten-2-one), 4-methylpent-1-ene, 2,2'-bis(phenylthio)propane, and glycidyl phenyl ether (1,2-epoxy-3-phenoxypropane), J. Chem. Eng. Data, 1997, 42, 1052-1066. [all data]

Contineanu and Marchidan, 1994
Contineanu, J.; Marchidan, D.I., The enthalpies of combustion and formation of some isomers of aminobutyric (aminobutanoic) acid, Rev. Roum. Chim., 1994, 39, 1391-1395. [all data]