Tricyclo[2.2.1.0(2,6)]heptan-3-ol, 4,5,5-trimethyl-

Normal alkane RI, non-polar column, custom temperature program

View large format table.

Column type Active phase I Reference Comment
CapillarySE-301149.Vinogradov, 2004Program: not specified
CapillaryPolydimethyl siloxanes1149.Zenkevich, 1997Program: not specified

References

Vinogradov, 2004
Vinogradov, B.A., Production, composition, properties and application of essential oils, 2004, retrieved from http://viness.narod.ru. [all data]

Zenkevich, 1997
Zenkevich, I.G., Analytical Parameters of Components of Essential Oils for their Chromatographic and Chromato-Spectral Identificaiton. Oxsigenated derivatives of Mono- and Sesquiterpene Hydrocarbons, Rastit, Resursy (Rus.), 1997, 33, 1, 16-28. [all data]