Methanol, chloro-, acetate

Kovats' RI, polar column, isothermal

Data compiled by: NIST Mass Spectrometry Data Center, William E. Wallace, director

Column type CapillaryCapillaryCapillaryCapillary
Active phase OV-351OV-351OV-351OV-351
Column length (m) 25.25.25.25.
Carrier gas N2N2N2N2
Substrate
Column diameter (mm) 0.320.320.320.32
Phase thickness (μm)
Temperature (C) 100.120.60.80.
I 1164.1174.1181.1180.
ReferenceHaken and Korhonen, 1986Haken and Korhonen, 1986Haken and Korhonen, 1986Haken and Korhonen, 1986
Comment MSDC-RI MSDC-RI MSDC-RI MSDC-RI

References

Haken and Korhonen, 1986
Haken, J.K.; Korhonen, I.O.O., Gas chromatography of homologous esters. XXXII. Capillary chromatography of C1-C18 monochlorinated n-alkyl acetates, J. Chromatogr., 1986, 356, 79-94, https://doi.org/10.1016/S0021-9673(00)91468-7 . [all data]