Ethanol, 2-nitro-

Condensed phase thermochemistry data

Data compiled by: Hussein Y. Afeefy, Joel F. Liebman, and Stephen E. Stein

Quantity Value Units Method Reference Comment
Δfliquid-83.8kcal/molCcbMedard and Thomas, 1953Heat of combustion corrected for pressure
Quantity Value Units Method Reference Comment
Δcliquid-289.2kcal/molCcbHandrick, 1956
Δcliquid-275.1kcal/molCcbMedard and Thomas, 1953Heat of combustion corrected for pressure
Δcliquid-220.20kcal/molCcbCastronia, 1949

Phase change data

Data compiled by: Robert L. Brown and Stephen E. Stein

Reduced pressure boiling point

Tboil (K) Pressure (atm) Reference
467.21.01Weast and Grasselli, 1989

Kovats' RI, polar column, isothermal

View large format table.

Column type Active phase Temperature (C) I Reference Comment
CapillaryCarbowax 20M413.2045.Boneva and Dimov, 1982N2; Column length: 24. m

Normal alkane RI, non-polar column, custom temperature program

View large format table.

Column type Active phase I Reference Comment
CapillaryBP-5658.Helsper, Bücking, et al., 200630. m/0.25 mm/1. μm, He; Program: 40C(2min) => 4C/min => 150C => 8C/min => 250C (15min)

References

Medard and Thomas, 1953
Medard, L.; Thomas, M., Determination des chaleurs de combustion de treize substances explosives ou apparentees a des explosifs, Mem. Poudres, 1953, 35, 155-173. [all data]

Handrick, 1956
Handrick, G.R., Report of the study of pure explosive compounds. Part IV. Calculation of heat of combustion of organic compounds from structural features and calculation of power of high explosives, Rpt. C-58247 for the Office of the Chief of Ordnance, contract DA-19-020-ORD-47 by the Arthur D. Little, Inc., Cambridge, MA, 1956, 467-573. [all data]

Castronia, 1949
Castronia, T.C., Long range basic research leading to the development of ideal propellants, Picatinny Arsenal Techn. Rep. No. 1755, 1949, 1. [all data]

Weast and Grasselli, 1989
CRC Handbook of Data on Organic Compounds, 2nd Editon, Weast,R.C and Grasselli, J.G., ed(s)., CRC Press, Inc., Boca Raton, FL, 1989, 1. [all data]

Boneva and Dimov, 1982
Boneva, S.; Dimov, N., Note. Glass capillary gas chromatography of C2-C5 2-nitro-1-alkanols, J. Chromatogr., 1982, 240, 1, 215-217, https://doi.org/10.1016/S0021-9673(01)84026-7 . [all data]

Helsper, Bücking, et al., 2006
Helsper, J.P.F.G.; Bücking, M.; Muresan, S.; Blaas, J.; Wietsma, W.A., Identification of the volatile component(s) causing the characteristic foxy odor in various cultivars of Fritillaria imperialis L. (Liliaceae), J. Agric. Food Chem., 2006, 54, 14, 5087-5091, https://doi.org/10.1021/jf0605594 . [all data]