Propane, 1-methoxy-2-methyl-

Phase change data

Quantity Value Units Method Reference Comment
Tboil331.7KN/AMajer and Svoboda, 1985
Quantity Value Units Method Reference Comment
Δvap30.31kJ/molN/AMajer and Svoboda, 1985

Enthalpy of vaporization

ΔvapH (kJ/mol) Temperature (K) Reference Comment
28.02331.7Majer and Svoboda, 1985

Kovats' RI, non-polar column, isothermal

View large format table.

Column type Active phase Temperature (C) I Reference Comment
PackedApiezon L120.556.Bogoslovsky, Anvaer, et al., 1978Celite 545
PackedApiezon L160.559.Bogoslovsky, Anvaer, et al., 1978Celite 545

Normal alkane RI, non-polar column, temperature ramp

View large format table.

Column type Active phase I Reference Comment
CapillaryDB-5574.Savel'eva, Zenkevich, et al., 200325. m/0.20 mm/0.33 μm, Helium, 40. C @ 1. min, 5. K/min, 270. C @ 15. min

References

Majer and Svoboda, 1985
Majer, V.; Svoboda, V., Enthalpies of Vaporization of Organic Compounds: A Critical Review and Data Compilation, Blackwell Scientific Publications, Oxford, 1985, 300. [all data]

Bogoslovsky, Anvaer, et al., 1978
Bogoslovsky, Yu.N.; Anvaer, B.I.; Vigdergauz, M.S., Chromatographic constants in gas chromatography (in Russian), Standards Publ. House, Moscow, 1978, 192. [all data]

Savel'eva, Zenkevich, et al., 2003
Savel'eva, E.I.; Zenkevich, I.G.; Radilov, A.S., Identification the Products of Chemical Neutralization of O-Isobutyl-S-(2-diethylaminoethyl)methylthiophosphonate in the Composition of Bitumen-Salt Matrices, Zh. Anal. Khim. (Rus.), 2003, 58, 2, 135-145. [all data]