2,4-heptadien-1-ol

Normal alkane RI, non-polar column, temperature ramp

Data compiled by: NIST Mass Spectrometry Data Center, William E. Wallace, director

Column type Capillary
Active phase Ultra-2
Column length (m) 50.
Carrier gas He
Substrate
Column diameter (mm) 0.32
Phase thickness (μm) 0.52
Tstart (C) 40.
Tend (C) 250.
Heat rate (K/min) 4.
Initial hold (min) 3.
Final hold (min) 30.
I 1039.
ReferenceKing, Matthews, et al., 1995
Comment MSDC-RI

References

King, Matthews, et al., 1995
King, M.-F.; Matthews, M.A.; Rule, D.C.; Field, R.A., Effect of beef packaging method on volatile compounds developed by oven roasting or microwave cooking, J. Agric. Food Chem., 1995, 43, 3, 773-778, https://doi.org/10.1021/jf00051a039 . [all data]