1,3,7,9-Tetrachlorodibenzo-p-dioxin

Phase change data

Data compiled by: William E. Acree, Jr., James S. Chickos

Enthalpy of sublimation

ΔsubH (kJ/mol) Temperature (K) Method Reference Comment
123.6 ± 1.5395.MELi, Shibata, et al., 2004Based on data from 383. - 408. K.

References

Li, Shibata, et al., 2004
Li, Xian-Wei; Shibata, Etsuro; Kasai, Eiki; Nakamura, Takashi, VAPOR PRESSURES AND ENTHALPIES OF SUBLIMATION OF 17 POLYCHLORINATED DIBENZO-p-DIOXINS AND FIVE POLYCHLORINATED DIBENZOFURANS, Environ Toxicol Chem, 2004, 23, 2, 348-808, https://doi.org/10.1897/03-193 . [all data]