Ethane, 1-chloro-2-iodo-

Gas phase thermochemistry data

Data compiled by: Hussein Y. Afeefy, Joel F. Liebman, and Stephen E. Stein

Quantity Value Units Method Reference Comment
Δfgas-47.7 ± 5.0kJ/molKinMinton, Felder, et al., 1984

Reaction thermochemistry data

Data compiled by: Hussein Y. Afeefy, Joel F. Liebman, and Stephen E. Stein

Individual Reactions

Ethane, 1-chloro-2-iodo- = Iodine atom + Chlorine atom + Ethylene

By formula: C2H4ClI = I + Cl + C2H4

Quantity Value Units Method Reference Comment
Δr320. ± 4.2kJ/molKinMinton, Felder, et al., 1984gas phase

References

Minton, Felder, et al., 1984
Minton, T.K.; Felder, P.; Brudzynski, R.J.; Lee, Y.T., Photodissociation of 1,2-chloroiodoethane at 248 and 266 nm: The enthalpy of formation of CH2ClCH2I, J. Chem. Phys., 1984, 81, 1759-1769. [all data]