Dieuropium monosulfide

Gas phase ion energetics data

Data compiled by: Sharon G. Lias, Rhoda D. Levin, and Sherif A. Kafafi

Ionization energy determinations

IE (eV) Method Reference
6.7 ± 0.5EISmoes, Drowart, et al., 1978
6.7 ± 0.5EISmoes, Drowart, et al., 1977

References

Smoes, Drowart, et al., 1978
Smoes, S.; Drowart, J.; Welter, J.M., Thermodynamic study of the vaporization of europium sulfide by the mass spectrometric Knudsen cell method, Adv. Mass Spectrom., 1978, 7, 622. [all data]

Smoes, Drowart, et al., 1977
Smoes, S.; Drowart, J.; Welter, J.M., Thermodynamic study of the vaporization of europium monosulfide by Knudsen-cell mass spectrometry atomization energies of EuS(g), Eu2S(g), EuS2(g), Eu2O(g), Eu2O2(g), Eu2OS(g), and Eu2S2(g), J. Chem. Thermodyn., 1977, 9, 275. [all data]