Pentanoic acid, 4-oxo-, methyl ester

Phase change data

Data compiled as indicated in comments:
BS - Robert L. Brown and Stephen E. Stein
AC - William E. Acree, Jr., James S. Chickos

Quantity Value Units Method Reference Comment
Tboil469.2KN/AWeast and Grasselli, 1989BS

Enthalpy of vaporization

ΔvapH (kJ/mol) Temperature (K) Method Reference Comment
50.4327.AStephenson and Malanowski, 1987Based on data from 312. - 471. K. See also Stull, 1947.; AC
51.1410.N/ASchuette and Cowley, 1931AC

Antoine Equation Parameters

log10(P) = A − (B / (T + C))
    P = vapor pressure (bar)
    T = temperature (K)

View plot Requires a JavaScript / HTML 5 canvas capable browser.

Temperature (K) A B C Reference Comment
312.9 - 470.94.889152086.056-44.271Stull, 1947Coefficents calculated by NIST from author's data.

References

Weast and Grasselli, 1989
CRC Handbook of Data on Organic Compounds, 2nd Editon, Weast,R.C and Grasselli, J.G., ed(s)., CRC Press, Inc., Boca Raton, FL, 1989, 1. [all data]

Stephenson and Malanowski, 1987
Stephenson, Richard M.; Malanowski, Stanislaw, Handbook of the Thermodynamics of Organic Compounds, 1987, https://doi.org/10.1007/978-94-009-3173-2 . [all data]

Stull, 1947
Stull, Daniel R., Vapor Pressure of Pure Substances. Organic and Inorganic Compounds, Ind. Eng. Chem., 1947, 39, 4, 517-540, https://doi.org/10.1021/ie50448a022 . [all data]

Schuette and Cowley, 1931
Schuette, H.A.; Cowley, Milford A., LEVULINIC ACID. II. THE VAPOR PRESSURES OF ITS ALKYL ESTERS (C 1 --C 6, J. Am. Chem. Soc., 1931, 53, 9, 3485-3489, https://doi.org/10.1021/ja01360a039 . [all data]