3-Heptanone, 6-methyl-

Van Den Dool and Kratz RI, polar column, custom temperature program

View large format table.

Column type Active phase I Reference Comment
CapillaryCarbowax 20M1263.Whitfield, Shea, et al., 1981Column length: 150. m; Column diameter: 0.75 mm; Program: not specified

Normal alkane RI, non-polar column, custom temperature program

View large format table.

Column type Active phase I Reference Comment
CapillaryAT-5941.Usai, Atzei, et al., 200360. m/0.25 mm/0.25 μm, He; Program: 50 0C 5 0C/min -> 135 0C (1 min) 5 0C/min -> 225 0C (5 min) 5 0C/min -> 260 0C

Normal alkane RI, polar column, temperature ramp

View large format table.

Column type Active phase I Reference Comment
CapillaryCP-Wax 52CB1231.Hwan and Chou, 199950. m/0.32 mm/0.22 μm, H2, 60. C @ 4. min, 2. K/min, 190. C @ 21. min

References

Whitfield, Shea, et al., 1981
Whitfield, F.B.; Shea, S.R.; Gillen, K.J.; Shaw, K.J., Volatile components from the roots of Acacia pulchella R.Br. and their effect on Phytophthora cinnamomi rands, Aust. J. Bot., 1981, 29, 2, 195-208, https://doi.org/10.1071/BT9810195 . [all data]

Usai, Atzei, et al., 2003
Usai, M.; Atzei, A.; Pintore, G.; Casanova, I., Composition and variability of the essential oil of Sardinian Thymus herba-barona Loisel, Flavour Fragr. J., 2003, 18, 1, 21-25, https://doi.org/10.1002/ffj.1137 . [all data]

Hwan and Chou, 1999
Hwan, C.-H.; Chou, C.-C., Volatile components of the Chinese fermented soya bean curd as affected by the addition of ethanol in ageing solution, J. Sci. Food Agric., 1999, 79, 2, 243-248, https://doi.org/10.1002/(SICI)1097-0010(199902)79:2<243::AID-JSFA179>3.0.CO;2-I . [all data]