Tetrahydro-1,2,4,5-tetrazine-3,6-dione

Condensed phase thermochemistry data

Data compiled by: Hussein Y. Afeefy, Joel F. Liebman, and Stephen E. Stein

Quantity Value Units Method Reference Comment
Δcsolid-1096.kJ/molCcrHandrick, 1956
Δcsolid-1113.kJ/molCcbHandrick, 1956Picatinny Arsenal Tech. report 1941 by S. Helf, I. Minsky, and B.D. Guida
Δcsolid-1097.5 ± 1.3kJ/molCcbYoung, Keith, et al., 1956Reanalyzed by Cox and Pilcher, 1970, Original value = -1101. ± 1. kJ/mol

References

Handrick, 1956
Handrick, G.R., Report of the study of pure explosive compounds. Part IV. Calculation of heat of combustion of organic compounds from structural features and calculation of power of high explosives, Rpt. C-58247 for the Office of the Chief of Ordnance, contract DA-19-020-ORD-47 by the Arthur D. Little, Inc., Cambridge, MA, 1956, 467-573. [all data]

Young, Keith, et al., 1956
Young, J.A.; Keith, J.E.; Stehle, P.; Dzombak, W.C.; Hunt, H., Heats of combustion of some organic nitrogen compounds, Ind. Eng. Chem., 1956, 48, 1375-1378. [all data]

Cox and Pilcher, 1970
Cox, J.D.; Pilcher, G., Thermochemistry of Organic and Organometallic Compounds, Academic Press, New York, 1970, 1-636. [all data]