Pyridine, 2,5-dibromo-

Phase change data

Data compiled by: William E. Acree, Jr., James S. Chickos

Quantity Value Units Method Reference Comment
Δsub82.1 ± 2.2kJ/molCRibeiro da Silva, 1997

References

Ribeiro da Silva, 1997
Ribeiro da Silva, M., Standard molar enthalpies of formation of 2- and 3-bromopyridine and of 2,5- and 2,6-dibromopyridine, The Journal of Chemical Thermodynamics, 1997, 29, 12, 1545-1551, https://doi.org/10.1006/jcht.1997.0268 . [all data]