2-methyl-1-hexanol

Phase change data

Data compiled as indicated in comments:
TRC - Thermodynamics Research Center, NIST Boulder Laboratories, Chris Muzny director
AC - William E. Acree, Jr., James S. Chickos

Quantity Value Units Method Reference Comment
Tboil436.KN/ANazarov and Kakhniashvili, 1954Uncertainty assigned by TRC = 4. K; TRC
Tboil436.85KN/APichler, Ziesecke, et al., 1950Uncertainty assigned by TRC = 0.5 K; TRC
Tboil437.65KN/AMorgan, Hardy, et al., 1932Uncertainty assigned by TRC = 2. K; TRC

Enthalpy of vaporization

ΔvapH (kcal/mol) Temperature (K) Reference Comment
12.8390.Wilhoit and Zwolinski, 1973Based on data from 343. - 438. K.; AC

In addition to the Thermodynamics Research Center (TRC) data available from this site, much more physical and chemical property data is available from the following TRC products:

Van Den Dool and Kratz RI, non-polar column, temperature ramp

View large format table.

Column type Active phase I Reference Comment
CapillaryCP Sil 5 CB915.Hendriks and Bruins, 19834. K/min; Column length: 25. m; Column diameter: 0.22 mm; Tstart: 70. C; Tend: 205. C

Normal alkane RI, non-polar column, temperature ramp

View large format table.

Column type Active phase I Reference Comment
CapillaryDB-1886.Habu, Flath, et al., 19853. K/min; Column length: 50. m; Column diameter: 0.32 mm; Tstart: 0. C; Tend: 250. C

References

Nazarov and Kakhniashvili, 1954
Nazarov, I.N.; Kakhniashvili, A.I., Acetylene Drivatives CLVI. Reduction of Vinyl Allyl Ketonoes with Aluminum Isopropoxide. Isomerization of Divinylcarbinols, Sb. Statei Obshch. Khim., 1954, 2, 896-904. [all data]

Pichler, Ziesecke, et al., 1950
Pichler, H.; Ziesecke, K.H.; Traeger, B., The Oxygen-containing Compounds, Especially Alcohols, Formed in Isosynthesis, Brennst.-Chem., 1950, 31, 361. [all data]

Morgan, Hardy, et al., 1932
Morgan, G.T.; Hardy, D.V.N.; Proctor, R.A., J. Soc. Chem. Ind., London, Trans. Commun., 1932, 51, 1-7T. [all data]

Wilhoit and Zwolinski, 1973
Wilhoit, R.C.; Zwolinski, B.J., Physical and thermodynamic properties of aliphatic alcohols, J. Phys. Chem. Ref. Data Suppl., 1973, 1, 2, 1. [all data]

Hendriks and Bruins, 1983
Hendriks, H.; Bruins, A.P., A tentative identification of components in the essential oil of Cannabis sativa L. by a combination of gas chromatography negative ion chemical ionization mass spectrometry and retention indices, Biomed. Mass Spectrom., 1983, 10, 6, 377-381, https://doi.org/10.1002/bms.1200100607 . [all data]

Habu, Flath, et al., 1985
Habu, T.; Flath, R.A.; Mon, T.R.; Morton, J.F., Volatile components of Rooibos tea (Aspalathus linearis), J. Agric. Food Chem., 1985, 33, 2, 249-254, https://doi.org/10.1021/jf00062a024 . [all data]