Heptanoic acid, heptyl ester

Phase change data

Data compiled by: Thermodynamics Research Center, NIST Boulder Laboratories, Chris Muzny director

Quantity Value Units Method Reference Comment
Tboil550.36KN/ABilterys and Gisseleire, 1935Uncertainty assigned by TRC = 0.3 K
Tboil547.8KN/AGartenmeister, 1886Uncertainty assigned by TRC = 3. K
Tboil550.KN/APerkin, 1884Uncertainty assigned by TRC = 3. K
Tboil544.KN/ACross, 1877Uncertainty assigned by TRC = 4. K
Quantity Value Units Method Reference Comment
Tfus239.9KN/ABilterys and Gisseleire, 1935Uncertainty assigned by TRC = 0.5 K

In addition to the Thermodynamics Research Center (TRC) data available from this site, much more physical and chemical property data is available from the following TRC products:

References

Bilterys and Gisseleire, 1935
Bilterys, R.; Gisseleire, J., Investigations on the Congelation Temperature of Organic Compounds, Bull. Soc. Chim. Belg., 1935, 44, 567. [all data]

Gartenmeister, 1886
Gartenmeister, R., Investigation of the physical characterstics of liquid compounds: vi boiling point and specific volume of normal fatty acid esters, Justus Liebigs Ann. Chem., 1886, 233, 249-315. [all data]

Perkin, 1884
Perkin, W.H., On the Magnetic Rotary Polarisation of Compounds in Relation to their Chemical Consitution; with Observations on the Preparation and Relative Densities of the Bodies Examined, J. Chem. Soc., 1884, 45, 421-580. [all data]

Cross, 1877
Cross, C.J., Normal Primary Heptyl Alcohol and Its Derivatives, Chem. Ber., 1877, 10, 1601-2. [all data]