Sulfurous acid, dipropyl ester

Gas phase thermochemistry data

Data compiled by: Hussein Y. Afeefy, Joel F. Liebman, and Stephen E. Stein

Quantity Value Units Method Reference Comment
Δfgas-588. ± 2.kJ/molCcbMackle and Steele, 1969

Condensed phase thermochemistry data

Data compiled by: Hussein Y. Afeefy, Joel F. Liebman, and Stephen E. Stein

Quantity Value Units Method Reference Comment
Δfliquid-646.6 ± 1.1kJ/molCcbMackle and Steele, 1969
Quantity Value Units Method Reference Comment
Δcliquid-4317.3 ± 1.0kJ/molCcbMackle and Steele, 1969

References

Mackle and Steele, 1969
Mackle, H.; Steele, W.V., Studies in the thermochemistry of organic sulphites and sulphates. Part 1.-Heats of combustion and formation of some dialkyl sulphites and sulphates, Trans. Faraday Soc., 1969, 65, 2053-2059. [all data]