Diethyl fumarate

Normal alkane RI, non-polar column, custom temperature program

Data compiled by: NIST Mass Spectrometry Data Center, William E. Wallace, director

Column type Capillary
Active phase SE-30
Column length (m)
Carrier gas
Substrate
Column diameter (mm)
Phase thickness (μm)
Program not specified
I 1160.
ReferenceVinogradov, 2004
Comment MSDC-RI

Phase change data

Data compiled as indicated in comments:
BS - Robert L. Brown and Stephen E. Stein
TRC - Thermodynamics Research Center, NIST Boulder Laboratories, Chris Muzny director
AC - William E. Acree, Jr., James S. Chickos

Quantity Value Units Method Reference Comment
Tboil491.7KN/AAldrich Chemical Company Inc., 1990BS
Tboil487.KN/ATurner, Meador, et al., 1957Uncertainty assigned by TRC = 2. K; TRC

Enthalpy of vaporization

ΔvapH (kcal/mol) Temperature (K) Method Reference Comment
12.7341.AStephenson and Malanowski, 1987Based on data from 326. - 492. K. See also Stull, 1947.; AC

Antoine Equation Parameters

log10(P) = A − (B / (T + C))
    P = vapor pressure (atm)
    T = temperature (K)

View plot Requires a JavaScript / HTML 5 canvas capable browser.

Temperature (K) A B C Reference Comment
326.4 - 491.75.109422350.619-32.09Stull, 1947Coefficents calculated by NIST from author's data.

In addition to the Thermodynamics Research Center (TRC) data available from this site, much more physical and chemical property data is available from the following TRC products:

Reaction thermochemistry data

Data compiled by: Hussein Y. Afeefy, Joel F. Liebman, and Stephen E. Stein

Individual Reactions

Hydrogen + Diethyl fumarate = Butanedioic acid, diethyl ester

By formula: H2 + C8H12O4 = C8H14O4

Quantity Value Units Method Reference Comment
Δr-28.94 ± 0.05kcal/molChydTurner, Meador, et al., 1957, 2liquid phase; solvent: Acetic acid
Δr-29.30 ± 0.15kcal/molChydWilliams, 1942liquid phase; solvent: Acetic acid; At 302 K

References

Vinogradov, 2004
Vinogradov, B.A., Production, composition, properties and application of essential oils, 2004, retrieved from http://viness.narod.ru. [all data]