1,2,3-Propanetriol, 1,3-dinitrate

Reaction thermochemistry data

Data compiled by: Hussein Y. Afeefy, Joel F. Liebman, and Stephen E. Stein

Individual Reactions

1,2,3-Propanetriol, 1,3-dinitrate + Nitric acid = Nitroglycerin + Water

By formula: C3H6N2O7 + HNO3 = C3H5N3O9 + H2O

Quantity Value Units Method Reference Comment
Δr-1.4 ± 0.3kcal/molEqkKazakov, Kirpichev, et al., 1990liquid phase; Heat of nitration
Δr-1.3 ± 0.3kcal/molCmKazakov, Lagodzinskaya, et al., 1989liquid phase

References

Kazakov, Kirpichev, et al., 1990
Kazakov, A.I.; Kirpichev, E.P.; Lagodzinskaya, G.V.; Andrienko, L.P.; Yunda, N.G.; Korolev, A.M.; Rubstov, Yu.I.; Manelis, G.B.; Eremenko, L.T., Study of nitration equilibrium in the glycerin-aqueous nitric acid system. 2. Changes in ΔH and ΔS in the nitration reaction, Bull. Acad. Sci. USSR, Div. Chem. Sci., 1990, 1565-1570. [all data]

Kazakov, Lagodzinskaya, et al., 1989
Kazakov, A.I.; Lagodzinskaya, E.P.; Kirpichev, E.P.; Andrienko, L.P.; Yunda, N.G.; Korolev, A.M.; Robtsov, Yu.I.; Manelis, G.V.; Eremenko, L.T., Thermodynamics of nitration of glycerol, Dokl. Phys. Chem. (Engl. Transl.), 1989, 305, 287-291. [all data]