Benzenehexacarboxylic acid, hexamethyl ester

Kovats' RI, non-polar column, isothermal

View large format table.

Column type Active phase Temperature (C) I Reference Comment
PackedOV-1200.2535.Fedoreev and Maksimov, 1977Gaschrom; Column length: 1.5 m

Condensed phase thermochemistry data

Data compiled by: Hussein Y. Afeefy, Joel F. Liebman, and Stephen E. Stein

Quantity Value Units Method Reference Comment
Δfsolid-504.49 ± 0.46kcal/molCcbColomina, Laynez, et al., 1972
Quantity Value Units Method Reference Comment
Δcsolid-1803.26 ± 0.41kcal/molCcbColomina, Laynez, et al., 1972Corresponding Δfsolid = -504.498 kcal/mol (simple calculation by NIST; no Washburn corrections)

Phase change data

Data compiled as indicated in comments:
TRC - Thermodynamics Research Center, NIST Boulder Laboratories, Chris Muzny director
AC - William E. Acree, Jr., James S. Chickos

Quantity Value Units Method Reference Comment
Tfus463.7KN/ADozen, Fujishima, et al., 1978Uncertainty assigned by TRC = 0.2 K; TRC
Quantity Value Units Method Reference Comment
Δsub36.88 ± 0.29kcal/molN/AJimenez, Menendez, et al., 1995AC

Enthalpy of sublimation

ΔsubH (kcal/mol) Temperature (K) Method Reference Comment
33.63 ± 0.26413.MEJimenez, Menendez, et al., 1995Based on data from 403. - 422. K.; AC

Enthalpy of fusion

ΔfusH (kcal/mol) Temperature (K) Method Reference Comment
5.38463.7DSCDozen, Fujishima, et al., 1978, 2AC

In addition to the Thermodynamics Research Center (TRC) data available from this site, much more physical and chemical property data is available from the following TRC products:

References

Fedoreev and Maksimov, 1977
Fedoreev, S.A.; Maksimov, O.B., The study of the composition of aromatic esters by gas-liquid chromatography, Solid Fuel Chem. (Engl. Transl.), 1977, 17-22. [all data]