Ethyl iodoacetate

Phase change data

Data compiled as indicated in comments:
BS - Robert L. Brown and Stephen E. Stein
AC - William E. Acree, Jr., James S. Chickos

Quantity Value Units Method Reference Comment
Tboil452.2KN/AWeast and Grasselli, 1989BS

Reduced pressure boiling point

Tboil (K) Pressure (bar) Reference Comment
346.20.021Weast and Grasselli, 1989BS

Enthalpy of vaporization

ΔvapH (kJ/mol) Temperature (K) Method Reference Comment
52.1316.AStephenson and Malanowski, 1987Based on data from 301. - 362. K. See also Gould, Holzman, et al., 1947.; AC

Kovats' RI, non-polar column, isothermal

View large format table.

Column type Active phase Temperature (C) I Reference Comment
CapillaryOV-10180.960.5Komárek, Hornová, et al., 1982N2; Column length: 15. m; Column diameter: 0.22 mm

References

Weast and Grasselli, 1989
CRC Handbook of Data on Organic Compounds, 2nd Editon, Weast,R.C and Grasselli, J.G., ed(s)., CRC Press, Inc., Boca Raton, FL, 1989, 1. [all data]

Stephenson and Malanowski, 1987
Stephenson, Richard M.; Malanowski, Stanislaw, Handbook of the Thermodynamics of Organic Compounds, 1987, https://doi.org/10.1007/978-94-009-3173-2 . [all data]

Gould, Holzman, et al., 1947
Gould, Clark.; Holzman, George.; Niemann, Carl., Determination of Vapor Pressure of Liquids on Milligram Scale, Anal. Chem., 1947, 19, 3, 204-206, https://doi.org/10.1021/ac60003a023 . [all data]

Komárek, Hornová, et al., 1982
Komárek, K.; Hornová, L.; Churácek, J., Glass capillary gas chromatography of homologous series of esters. Separation of homologous series of esters of halogenated carboxylic acids on a glass capillary column with the non-polar stationary silicone phase OV-101, J. Chromatogr., 1982, 244, 1, 142-147, https://doi.org/10.1016/S0021-9673(00)80131-4 . [all data]