Cyclopentene, 3-ethylidene-1-methyl-

Normal alkane RI, polar column, custom temperature program

Data compiled by: NIST Mass Spectrometry Data Center, William E. Wallace, director

Column type CapillaryCapillaryCapillaryCapillaryCapillary
Active phase DB-WaxDB-WaxDB-WaxDB-WaxDB-Wax
Column length (m) 30.60.60.60.60.
Carrier gas HeHeHeHeHe
Substrate
Column diameter (mm) 0.320.320.320.320.32
Phase thickness (μm) 0.50.50.50.50.5
Program 40C => 1C/min => 57C => 15C/min => 230C (5min)50C(6min) => 1C/min => 130C => 10C/min => 240C (15min)50C(6min) => 1C/min => 130C => 10C/min => 240C (15min)50C(6min) => 1C/min => 130C => 10C/min => 240C (15min)50C(6min) => 1C/min => 130C => 10C/min => 240C (15min)
I 1163.1168.1178.1195.1207.
Referencele Pape, Grua-Priol, et al., 2004Piveteau, le Guen, et al., 2000Piveteau, le Guen, et al., 2000Piveteau, le Guen, et al., 2000Piveteau, le Guen, et al., 2000
Comment MSDC-RI MSDC-RI MSDC-RI MSDC-RI MSDC-RI

References

le Pape, Grua-Priol, et al., 2004
le Pape, M.-A.; Grua-Priol, J.; Prost, C.; Demaimay, M., Optimization of dynamic headspace extraction of the edible red algae Palmaria palmata and identification of the volatile components, J. Agric. Food Chem., 2004, 52, 3, 550-556, https://doi.org/10.1021/jf030478x . [all data]

Piveteau, le Guen, et al., 2000
Piveteau, F.; le Guen, S.; Gandemer, G.; Baud, J.-P.; Demaimay, M., Aroma of fresh oysters Crassostrea gigas: composition and aroma notes, J. Agric. Food Chem., 2000, 48, 10, 4851-4857, https://doi.org/10.1021/jf991394k . [all data]