Benzene, 1-methyl-4-(methylthio)-

Phase change data

Data compiled by: Robert L. Brown and Stephen E. Stein

Reduced pressure boiling point

Tboil (K) Pressure (atm) Reference
326.20.001Aldrich Chemical Company Inc., 1990

Gas phase ion energetics data

Data compiled as indicated in comments:
LLK - Sharon G. Lias, Rhoda D. Levin, and Sherif A. Kafafi

Ionization energy determinations

IE (eV) Method Reference Comment
7.9 ± 0.05PEBernardi, Distefano, et al., 1975Vertical value; LLK
7.87PEDewar, Ernstbrunner, et al., 1974Vertical value; LLK
8.50PEDewar, Ernstbrunner, et al., 1974Vertical value; LLK

References

Aldrich Chemical Company Inc., 1990
Aldrich Chemical Company Inc., Catalog Handbook of Fine Chemicals, Aldrich Chemical Company, Inc., Milwaukee WI, 1990, 1. [all data]

Bernardi, Distefano, et al., 1975
Bernardi, F.; Distefano, G.; Mangini, A.; Pignataro, S.; Spunta, G., Photoelectron spectra of substituted anisoles thioanisoles, J. Electron Spectrosc. Relat. Phenom., 1975, 7, 457. [all data]

Dewar, Ernstbrunner, et al., 1974
Dewar, P.S.; Ernstbrunner, E.; Gilmore, J.R.; Godfrey, M.; Mellor, J.M., Conformational analysis of alkyl aryl ethers and alkyl aryl sulphides by photoelectron spectroscopy, Tetrahedron, 1974, 30, 2455. [all data]