Benzene, 1-methyl-4-nitroso-

Reaction thermochemistry data

Data compiled by: John E. Bartmess

Individual Reactions

C7H6NO- + Hydrogen cation = Benzene, 1-methyl-4-nitroso-

By formula: C7H6NO- + H+ = C7H7NO

Quantity Value Units Method Reference Comment
Δr1472. ± 8.8kJ/molG+TSTaft and Topsom, 1987gas phase; value altered from reference due to change in acidity scale
Quantity Value Units Method Reference Comment
Δr1444. ± 8.4kJ/molIMRETaft and Topsom, 1987gas phase; value altered from reference due to change in acidity scale

References

Taft and Topsom, 1987
Taft, R.W.; Topsom, R.D., The Nature and Analysis of Substituent Effects, Prog. Phys. Org. Chem., 1987, 16, 1. [all data]