Benzene, 1-chloro-4-ethyl-

Condensed phase thermochemistry data

Data compiled by: Hussein Y. Afeefy, Joel F. Liebman, and Stephen E. Stein

Quantity Value Units Method Reference Comment
Δfliquid-11.91 ± 0.26kcal/molEqkKovzel, Nesterova, et al., 1982
Δfliquid-12.33 ± 0.31kcal/molCcbHubbard, Knowlton, et al., 1954
Quantity Value Units Method Reference Comment
Δcliquid-1052.96 ± 0.31kcal/molCcbHubbard, Knowlton, et al., 1954

Reaction thermochemistry data

Data compiled by: Hussein Y. Afeefy, Joel F. Liebman, and Stephen E. Stein

Individual Reactions

Benzene, 1-chloro-2-ethyl- = Benzene, 1-chloro-4-ethyl-

By formula: C8H9Cl = C8H9Cl

Quantity Value Units Method Reference Comment
Δr-0.31 ± 0.32kcal/molEqkKovzel, Nesterova, et al., 1982liquid phase

Benzene, 1-chloro-4-ethyl- = Benzene, 1-chloro-3-ethyl-

By formula: C8H9Cl = C8H9Cl

Quantity Value Units Method Reference Comment
Δr-0.2 ± 0.2kcal/molEqkKovzel, Nesterova, et al., 1982liquid phase

References

Kovzel, Nesterova, et al., 1982
Kovzel, E.N.; Nesterova, T.N.; Rozhnov, A.M., Heats of formation of ethylchlorobenzenes, Deposited Document, SPSTL 371 Khp-D80. Chem. Abst. 97:5737h, 1982, 1-6. [all data]

Hubbard, Knowlton, et al., 1954
Hubbard, W.N.; Knowlton, J.W.; Huffman, H.M., Combustion calorimetry of organic chlorine compounds. Heats of combustion of chlorobenzene, the dichlorobenzenes and o- and p-chloroethylbenzene, J. Phys. Chem., 1954, 58, 396. [all data]