Benzene, 1-ethenyl-4-methyl-

Phase change data

Data compiled as indicated in comments:
BS - Robert L. Brown and Stephen E. Stein
TRC - Thermodynamics Research Center, NIST Boulder Laboratories, Chris Muzny director
AC - William E. Acree, Jr., James S. Chickos

Quantity Value Units Method Reference Comment
Tboil446.0KN/AWeast and Grasselli, 1989BS
Tboil444.95KN/ALevi and Nicholls, 1958Uncertainty assigned by TRC = 2. K; TRC
Tboil444.65KN/ASabetay, 1929Uncertainty assigned by TRC = 3. K; TRC
Tboil445.65KN/ASchramm, 1891Uncertainty assigned by TRC = 4. K; TRC
Quantity Value Units Method Reference Comment
Tfus239.30KN/ASchwartzman and Corson, 1956Uncertainty assigned by TRC = 0.4 K; TRC
Tfus239.00KN/AClements, Wise, et al., 1953Uncertainty assigned by TRC = 0.15 K; TRC
Tfus235.35KN/ABuck, Coles, et al., 1949Uncertainty assigned by TRC = 0.5 K; TRC
Tfus202.85KN/ADreisbach and Martin, 1949probably 2-methylstyrene; TRC

Enthalpy of vaporization

ΔvapH (kJ/mol) Temperature (K) Method Reference Comment
47.6319.AStephenson and Malanowski, 1987Based on data from 304. - 390. K. See also Clements, Wise, et al., 1953, 2.; AC

Antoine Equation Parameters

log10(P) = A − (B / (T + C))
    P = vapor pressure (bar)
    T = temperature (K)

View plot Requires a JavaScript / HTML 5 canvas capable browser.

Temperature (K) A B C Reference Comment
304.97 - 370.084.173321594.812-63.255Clements, Wise, et al., 1953, 2Coefficents calculated by NIST from author's data.
341.8 - 443.4.108811517.281-74.304Buck, Coles, et al., 1949, 2Coefficents calculated by NIST from author's data.

In addition to the Thermodynamics Research Center (TRC) data available from this site, much more physical and chemical property data is available from the following TRC products:

Gas phase ion energetics data

Data evaluated as indicated in comments:
HL - Edward P. Hunter and Sharon G. Lias

Data compiled as indicated in comments:
LLK - Sharon G. Lias, Rhoda D. Levin, and Sherif A. Kafafi

Quantity Value Units Method Reference Comment
Proton affinity (review)861.7kJ/molN/AHunter and Lias, 1998HL
Quantity Value Units Method Reference Comment
Gas basicity832.8kJ/molN/AHunter and Lias, 1998HL

Ionization energy determinations

IE (eV) Method Reference Comment
8.1 ± 0.1EIKoppel, Schwarz, et al., 1974LLK
8.20PEKobayashi, Yokota, et al., 1973Vertical value; LLK

Appearance energy determinations

Ion AE (eV) Other Products MethodReferenceComment
C9H9+11.8 ± 0.1HEIKoppel, Schwarz, et al., 1974LLK

Normal alkane RI, polar column, custom temperature program

Data compiled by: NIST Mass Spectrometry Data Center, William E. Wallace, director

Column type Capillary
Active phase Carbowax 20M
Column length (m)
Carrier gas
Substrate
Column diameter (mm)
Phase thickness (μm)
Program not specified
I 1349.
ReferenceCornwell and Cordano, 2003
Comment MSDC-RI

Henry's Law data

Data compiled by: Rolf Sander

Henry's Law constant (water solution)

kH(T) = H exp(d(ln(kH))/d(1/T) ((1/T) - 1/(298.15 K)))
H = Henry's law constant for solubility in water at 298.15 K (mol/(kg*bar))
d(ln(kH))/d(1/T) = Temperature dependence constant (K)

H (mol/(kg*bar)) d(ln(kH))/d(1/T) (K) Method Reference Comment
0.35 QN/A missing citation give several references for the Henry's law constants but don't assign them to specific species.

Gas phase thermochemistry data

Data compiled by: Glushko Thermocenter, Russian Academy of Sciences, Moscow

Constant pressure heat capacity of gas

Cp,gas (cal/mol*K) Temperature (K) Reference Comment
11.150.Thermodynamics Research Center, 1997p=1 bar.
14.1100.
17.9150.
22.4200.
30.02273.15
32.79298.15
32.98300.
43.67400.
52.92500.
60.47600.
66.68700.
71.85800.
76.17900.
79.851000.
82.91100.
85.61200.
88.01300.
89.91400.
91.81500.

References

Weast and Grasselli, 1989
CRC Handbook of Data on Organic Compounds, 2nd Editon, Weast,R.C and Grasselli, J.G., ed(s)., CRC Press, Inc., Boca Raton, FL, 1989, 1. [all data]

Levi and Nicholls, 1958
Levi, L.; Nicholls, R.V.V., Formation of Styrene by Pyrolysis of Aromatic Heterocyclic Aldehyde- Aliphatic Acid Anhydride Mixtures on Morden Bentonite, Ind. Eng. Chem., 1958, 50, 1005. [all data]

Sabetay, 1929
Sabetay, S., Bull. Soc. Chim. Fr., 1929, 45, 69. [all data]

Schramm, 1891
Schramm, J., Chem. Ber., 1891, 24, 1332. [all data]

Schwartzman and Corson, 1956
Schwartzman, L.H.; Corson, B.B., Steric Hinderance. II. The Rates of Dehalogenation of Methyl- and Dimethylstyrene Dibromides, J. Am. Chem. Soc., 1956, 78, 322. [all data]

Clements, Wise, et al., 1953
Clements, H.E.; Wise, K.V.; Johnson, S.E.J., Physical Properties of o-, m-, and p-Methylstyrene, J. Am. Chem. Soc., 1953, 75, 1593. [all data]

Buck, Coles, et al., 1949
Buck, F.R.; Coles, K.F.; Kennedy, G.T.; Morton, F., Some Nuclear-methylated Styrenes and Related Compounds, J. Chem. Soc., 1949, 1949, 2377-83. [all data]

Dreisbach and Martin, 1949
Dreisbach, R.R.; Martin, R.A., Physical Data on Some Organic Compounds, Ind. Eng. Chem., 1949, 41, 2875-8. [all data]

Stephenson and Malanowski, 1987
Stephenson, Richard M.; Malanowski, Stanislaw, Handbook of the Thermodynamics of Organic Compounds, 1987, https://doi.org/10.1007/978-94-009-3173-2 . [all data]

Clements, Wise, et al., 1953, 2
Clements, H.E.; Wise, K.V.; Johnsen, S.E.J., Physical properties of o-, m- and p-methylstyrene, J. Am. Chem. Soc., 1953, 75, 1593-1595. [all data]

Buck, Coles, et al., 1949, 2
Buck, F.R.; Coles, K.F.; Kennedy, G.T.; Morton, F., Some Nuclear-methylated Styrenes and Related Compounds, J. Chem. Soc., 1949, 2377-2383, https://doi.org/10.1039/jr9490002377 . [all data]