D-Raffinose

Condensed phase thermochemistry data

Data compiled by: Hussein Y. Afeefy, Joel F. Liebman, and Stephen E. Stein

Quantity Value Units Method Reference Comment
Δcsolid-8483.1kJ/molCcbSwietoslawski and Starczewska, 1928Heat of combustion corrected for constant pressure; Corresponding Δfsolid = -3174. kJ/mol (simple calculation by NIST; no Washburn corrections)

References

Swietoslawski and Starczewska, 1928
Swietoslawski, W.; Starczewska, H., Influence of certain corrections on the results of measurements of the heat of combustion of organic substances, Bull. Int. Acad. Pol. Sci. Lett. Cl. Med., 1928, 85-97. [all data]