Silane,(3-chlorophenyl)fluorodimethyl-

Gas phase ion energetics data

Data compiled by: Sharon G. Lias, Rhoda D. Levin, and Sherif A. Kafafi

Ionization energy determinations

IE (eV) Method Reference
9.09EIGey and Dube, 1976

Appearance energy determinations

Ion AE (eV) Other Products MethodReferenceComment
C7H7FSiCl+11.13CH3EIDube and Gey, 1979

References

Gey and Dube, 1976
Gey, E.; Dube, G., Die Ionisierungsenergien von substituierten Phenyldimethylmethoxysilanen und Phenyldimethylfluorsilanen, Int. J. Mass Spectrom. Ion Phys., 1976, 22, 103. [all data]

Dube and Gey, 1979
Dube, G.; Gey, E., Das Verhalten disubstituierter Bnzole RC6H4Si(CH3)2F bei Eektronenstob, Org. Mass Spectrom., 1979, 14, 17. [all data]