Benzenamine,4-(methoxydimethylsilyl)-N,N-dimethyl-

Gas phase ion energetics data

Data compiled by: Sharon G. Lias, Rhoda D. Levin, and Sherif A. Kafafi

Ionization energy determinations

IE (eV) Method Reference
7.45EIGey and Dube, 1976

References

Gey and Dube, 1976
Gey, E.; Dube, G., Die Ionisierungsenergien von substituierten Phenyldimethylmethoxysilanen und Phenyldimethylfluorsilanen, Int. J. Mass Spectrom. Ion Phys., 1976, 22, 103. [all data]