2-Butanone, methyl-2-propenylhydrazone

Gas phase ion energetics data

Data compiled by: Sharon G. Lias, John E. Bartmess, Joel F. Liebman, John L. Holmes, Rhoda D. Levin, and W. Gary Mallard

Appearance energy determinations

Ion AE (eV) Other Products MethodReferenceComment
C5H10N2+7.7 ± 0.1C3H6PIZenkevich, Isidorov, et al., 1986
C5H11N2+8.4 ± 0.1C3H5PIZenkevich, Isidorov, et al., 1986
C7H13+8.6 ± 0.1CH3N2PIZenkevich, Isidorov, et al., 1986

References

Zenkevich, Isidorov, et al., 1986
Zenkevich, I.G.; Isidorov, V.A.; Ioffe, B.V., Mass spectra of organic derivatives of hydrazine. IV.* Skeletal rearrangements in the molecular ions of allylhydrazones, J. Org. Chem. USSR, 1986, 22, 1613. [all data]