Cyclohexyl propionate

Phase change data

Data compiled by: William E. Acree, Jr., James S. Chickos

Quantity Value Units Method Reference Comment
Δvap55.9 ± 0.1kJ/molCPaulechka, Zaitsau, et al., 2004See also Zaitsau, Verevkin, et al., 2003.
Δvap59.4 ± 0.8kJ/molMEZaitsau, Verevkin, et al., 2003Based on data from 253. - 293. K.
Δvap56.4 ± 0.5kJ/molMEZaitsau, Verevkin, et al., 2003Based on data from 253. - 293. K.
Δvap54.3 ± 0.4kJ/molGSZaitsau, Verevkin, et al., 2003Based on data from 274. - 313. K.
Δvap56.8kJ/molCGCVerevkin and Heintz, 1999Based on data from 333. - 378. K.

Normal alkane RI, non-polar column, custom temperature program

Data compiled by: NIST Mass Spectrometry Data Center, William E. Wallace, director

Column type Capillary
Active phase SE-30
Column length (m)
Carrier gas
Substrate
Column diameter (mm)
Phase thickness (μm)
Program not specified
I 1120.
ReferenceVinogradov, 2004
Comment MSDC-RI

References

Paulechka, Zaitsau, et al., 2004
Paulechka, Y.U.; Zaitsau, Dz.H.; Kabo, G.J., On the difference between isobaric and isochoric heat capacities of liquid cyclohexyl esters, Journal of Molecular Liquids, 2004, 115, 2-3, 105-111, https://doi.org/10.1016/j.molliq.2004.03.002 . [all data]

Zaitsau, Verevkin, et al., 2003
Zaitsau, Dzmitry H.; Verevkin, Sergey P.; Paulechka, Yauheni U.; Kabo, Gennady J.; Sevruk, Viktor M., Comprehensive Study of Vapor Pressures and Enthalpies of Vaporization of Cyclohexyl Esters, J. Chem. Eng. Data, 2003, 48, 6, 1393-1400, https://doi.org/10.1021/je025634v . [all data]

Verevkin and Heintz, 1999
Verevkin, Sergey P.; Heintz, Andreas, Determination of Vaporization Enthalpies of the Branched Esters from Correlation Gas Chromatography and Transpiration Methods, J. Chem. Eng. Data, 1999, 44, 6, 1240-1244, https://doi.org/10.1021/je990122a . [all data]