Propanoic acid, tetradecyl ester

Kovats' RI, non-polar column, isothermal

Data compiled by: NIST Mass Spectrometry Data Center, William E. Wallace, director

Column type CapillaryCapillaryCapillaryCapillaryCapillary
Active phase SE-30SE-30SE-30SE-30SE-30
Column length (m) 25.25.25.25.25.
Carrier gas
Substrate
Column diameter (mm) 0.330.330.330.330.33
Phase thickness (μm)
Temperature (C) 160.180.200.220.240.
I 1880.1883.1881.1877.1878.
ReferenceHaken and Korhonen, 1985Haken and Korhonen, 1985Haken and Korhonen, 1985Haken and Korhonen, 1985Haken and Korhonen, 1985
Comment MSDC-RI MSDC-RI MSDC-RI MSDC-RI MSDC-RI
Column type CapillaryPacked
Active phase OV-101SE-30
Column length (m) 15.2.
Carrier gas
Substrate  Chromosorb W
Column diameter (mm) 0.22
Phase thickness (μm)
Temperature (C) 200.180.
I 1884.1873.
ReferenceKomárek, Hornová, et al., 1983Zarazir, Chovin, et al., 1970
Comment MSDC-RI MSDC-RI

References

Haken and Korhonen, 1985
Haken, J.K.; Korhonen, I.O.O., Gas chromatography of homologous esters. XXVII. Retention increments of C1-C18 primary alkanols and their 2-chloropropanoyl and 3-chloropropanoyl derivatives on SE-30 and OV-351 capillary columns, J. Chromatogr., 1985, 319, 131-142, https://doi.org/10.1016/S0021-9673(01)90548-5 . [all data]

Komárek, Hornová, et al., 1983
Komárek, K.; Hornová, L.; Horna, A.; Churácek, J., Glass capillary gas chromatography of homologous series of esters. III. Separation of alkyl halogenopropionates and halogenobutyrates on OV-101, J. Chromatogr., 1983, 262, 316-320, https://doi.org/10.1016/S0021-9673(01)88112-7 . [all data]

Zarazir, Chovin, et al., 1970
Zarazir, D.; Chovin, P.; Guiochon, G., Identification of hydroxylic compounds and their derivatives by gas chromatography, Chromatographia, 1970, 3, 4, 180-195, https://doi.org/10.1007/BF02269018 . [all data]