1-Dodecanol, TMS derivative

Van Den Dool and Kratz RI, polar column, temperature ramp

Data compiled by: NIST Mass Spectrometry Data Center, William E. Wallace, director

Column type CapillaryPacked
Active phase Carbowax 20MCarbowax 20M
Column length (m) 3.053.05
Carrier gas
Substrate  Supelcoport
Column diameter (mm)
Phase thickness (μm)
Tstart (C) 40.40.
Tend (C) 200.200.
Heat rate (K/min) 8.8.
Initial hold (min)  4.
Final hold (min) 60.
I 1573.1573.
ReferencePeng, 1992Peng, Yang, et al., 1991
Comment MSDC-RI MSDC-RI

References

Peng, 1992
Peng, C.T., A method for tentative identificatoin of unknown gas chromatographic peaks by retention index, J. Radioanal. Nucl. Chem., 1992, 160, 2, 449-460, https://doi.org/10.1007/BF02037120 . [all data]

Peng, Yang, et al., 1991
Peng, C.T.; Yang, Z.C.; Maltby, D., Prediction of retention indexes. III. Silylated derivatives of polar compounds, J. Chromatogr., 1991, 586, 1, 113-129, https://doi.org/10.1016/0021-9673(91)80029-G . [all data]