Tricyclo[6.1.0.03,5]non-6-ene(1α,3α,5α,8α)-

Gas phase ion energetics data

Data compiled by: Sharon G. Lias, Rhoda D. Levin, and Sherif A. Kafafi

Ionization energy determinations

IE (eV) Method Reference Comment
9.0PESpanget-Larsen, Gleiter, et al., 1978Vertical value

References

Spanget-Larsen, Gleiter, et al., 1978
Spanget-Larsen, J.; Gleiter, R.; Detty, M.R.; Paguette, L.A., Interaction of Walsh orbitals in trishomocycloheptatrienes and related hydrocarbons, J. Am. Chem. Soc., 1978, 100, 3005. [all data]