1,7-Diazido-2,4,6-trinitro-2,4,6-triazaheptane

Phase change data

Data compiled by: William E. Acree, Jr., James S. Chickos

Enthalpy of fusion

ΔfusH (kJ/mol) Temperature (K) Reference
40.17406.Oyumi and Brill, 1987

References

Oyumi and Brill, 1987
Oyumi, Y.; Brill, T.B., Thermal decomposition of energetic materials. 23. Thermochemical differentiation of cyclic and acyclic nitramines by their phase transitions, Thermochim. Acta, 1987, 116, 125-130. [all data]