3,3,6,6-Tetramethyloctane

Condensed phase thermochemistry data

Data compiled by: Hussein Y. Afeefy, Joel F. Liebman, and Stephen E. Stein

Quantity Value Units Method Reference Comment
Δcliquid-8065.1kJ/molCcbShtekher, Skuratov, et al., 1959Corresponding Δfliquid = -373. kJ/mol (simple calculation by NIST; no Washburn corrections)

References

Shtekher, Skuratov, et al., 1959
Shtekher, S.M.; Skuratov, S.M.; Daukshas, V.K.; Levina, R.Ya., Heats of combustion of some branched alkanes, Dokl. Akad. Nauk SSSR, 1959, 127, 812-814. [all data]