1-Pentanamine, N,N-dipentyl-

Kovats' RI, non-polar column, isothermal

View large format table.

Column type Active phase Temperature (C) I Reference Comment
PackedApiezon L80.1427.Zhuravleva, Golovnya, et al., 1981Chromosorb G AW (80-100 mesh); Column length: 2.7 m
PackedApiezon L100.1427.Golovnya and Zhuravleva, 1973

Kovats' RI, non-polar column, temperature ramp

View large format table.

Column type Active phase I Reference Comment
CapillaryDB-11420.Hall, Whitehead, et al., 1986He, 6. K/min; Column length: 15. m; Column diameter: 0.25 mm; Tstart: 100. C; Tend: 270. C
CapillaryDB-51420.Hall, Whitehead, et al., 1986He, 6. K/min; Column length: 15. m; Column diameter: 0.25 mm; Tstart: 100. C; Tend: 270. C

Normal alkane RI, non-polar column, temperature ramp

View large format table.

Column type Active phase I Reference Comment
CapillaryUltra-11456.Okumura, 199125. m/0.32 mm/0.25 μm, He, 3. K/min; Tstart: 80. C; Tend: 260. C

Normal alkane RI, polar column, custom temperature program

View large format table.

Column type Active phase I Reference Comment
CapillaryDB-Wax1469.Peng, Yang, et al., 1991Program: not specified

References

Zhuravleva, Golovnya, et al., 1981
Zhuravleva, I.L.; Golovnya, R.V.; Terenina, M.B.; Grigorieva, D.N., Gas chromatographic behaviour of some unsymmetrical tertiary amines, Zh. Anal. Khim., 1981, 36, 968-975. [all data]

Golovnya and Zhuravleva, 1973
Golovnya, R.V.; Zhuravleva, I.L., Gas Chromatographic Method of Identification of n-Aliphatic Amines Through the Use of Donor-Acceptor Interaction with Phosphate, Chromatographia, 1973, 6, 12, 508-513, https://doi.org/10.1007/BF02269131 . [all data]

Hall, Whitehead, et al., 1986
Hall, G.L.; Whitehead, W.E.; Mourer, C.R.; Shibamoto, T., A new gas chromatographic retention index for pesticides and related compounds, J. Hi. Res. Chromatogr. Chromatogr. Comm., 1986, 9, 5, 266-271, https://doi.org/10.1002/jhrc.1240090503 . [all data]

Okumura, 1991
Okumura, T., retention indices of environmental chemicals on methyl silicone capillary column, Journal of Environmental Chemistry (Japan), 1991, 1, 2, 333-358, https://doi.org/10.5985/jec.1.333 . [all data]

Peng, Yang, et al., 1991
Peng, C.T.; Yang, Z.C.; Ding, S.F., Prediction of rentention idexes. II. Structure-retention index relationship on polar columns, J. Chromatogr., 1991, 586, 1, 85-112, https://doi.org/10.1016/0021-9673(91)80028-F . [all data]