Bendazol

Phase change data

Data compiled by: William E. Acree, Jr., James S. Chickos

Quantity Value Units Method Reference Comment
Δsub136.2 ± 0.5kJ/molMERibeiro da Silva, Ribeiro da Silva, et al., 2005Based on data from 393. - 412. K.

Enthalpy of sublimation

ΔsubH (kJ/mol) Temperature (K) Method Reference Comment
134.5 ± 0.5403.MERibeiro da Silva, Ribeiro da Silva, et al., 2005Based on data from 393. - 412. K.

References

Ribeiro da Silva, Ribeiro da Silva, et al., 2005
Ribeiro da Silva, Manuel A.V.; Ribeiro da Silva, Maria das Dores M.C.; Amaral, Luísa M.P.F.; Elguero, José; Jiménez, Pilar; Roux, Maria Victoria; Dávalos, Juan Z.; Temprado, Manuel; Cabildo, Pilar; Claramunt, Rosa M.; Mó, Otília; Yáñez, Manuel, Thermochemical properties of two benzimidazole derivatives: 2-Phenyl- and 2-benzylbenzimidazole, The Journal of Chemical Thermodynamics, 2005, 37, 11, 1168-1176, https://doi.org/10.1016/j.jct.2005.02.008 . [all data]