3-Propoxy-1,3,3-triphenylpropyne

Condensed phase thermochemistry data

Data compiled by: Hussein Y. Afeefy, Joel F. Liebman, and Stephen E. Stein

Quantity Value Units Method Reference Comment
Δfsolid-30.8kcal/molCcbLandrieu and Blatt, 1924
Quantity Value Units Method Reference Comment
Δcsolid-3042.kcal/molCcbLandrieu and Blatt, 1924Corresponding Δfsolid = 33. kcal/mol (simple calculation by NIST; no Washburn corrections)

References

Landrieu and Blatt, 1924
Landrieu, P.; Blatt, H., Thermochemical study of diphenylphenylethinylcarbinol and its derivatives, Bull. Soc. Chim. Fr., 1924, 35, 1424-1236. [all data]