1-iodononacosane

Phase change data

Data compiled by: Thermodynamics Research Center, NIST Boulder Laboratories, Chris Muzny director

Quantity Value Units Method Reference Comment
Tfus340.8KN/AStallberg, Stallberg-Stenhagen, et al., 1952Uncertainty assigned by TRC = 0.4 K

In addition to the Thermodynamics Research Center (TRC) data available from this site, much more physical and chemical property data is available from the following TRC products:

References

Stallberg, Stallberg-Stenhagen, et al., 1952
Stallberg, G.; Stallberg-Stenhagen, S.; Stenhagen, E., Very Long Hydrocarbon Chains I. The Synthesis of n-Dooctacontane and n-Hectane, Acta Chem. Scand., 1952, 6, 313. [all data]