Acetamide, N-(3-bromophenyl)-

Gas phase ion energetics data

Data compiled by: Henry M. Rosenstock, Keith Draxl, Bruce W. Steiner, and John T. Herron

Ionization energy determinations

IE (eV) Method Reference
8.6 ± 0.2EIGamble, Gilbert, et al., 1970

Appearance energy determinations

Ion AE (eV) Other Products MethodReferenceComment
C6H6NBr+10.6 ± 0.2?EIGamble, Gilbert, et al., 1970

References

Gamble, Gilbert, et al., 1970
Gamble, A.A.; Gilbert, J.R.; Tillett, J.G., Substituent effects in the fragmentation of acetanilides,, J. Chem. Soc. B, 1970, 1231. [all data]