1-Iodononadecane

Phase change data

Data compiled by: William E. Acree, Jr., James S. Chickos

Quantity Value Units Method Reference Comment
Δvap113.8kJ/molA,ESTStephenson and Malanowski, 1987Based on data from 506. - 673. K. See also Li and Rossini, 1961 and Bolotnikov and Neruchev, 2006.

Enthalpy of vaporization

ΔvapH (kJ/mol) Temperature (K) Method Reference Comment
79.1521.A,ESTStephenson and Malanowski, 1987Based on data from 506. - 673. K. See also Li and Rossini, 1961 and Dykyj and Vanko, 1970.

References

Stephenson and Malanowski, 1987
Stephenson, Richard M.; Malanowski, Stanislaw, Handbook of the Thermodynamics of Organic Compounds, 1987, https://doi.org/10.1007/978-94-009-3173-2 . [all data]

Li and Rossini, 1961
Li, J.C.M.; Rossini, F.D., Vapor Pressures and Boiling Points of the l-Fluoroalkanes, l-Chloroalkanes, l-Bromoalkanes, and l-Iodoalkanes, C 1 to C 20 ., J. Chem. Eng. Data, 1961, 6, 2, 268-270, https://doi.org/10.1021/je60010a025 . [all data]

Bolotnikov and Neruchev, 2006
Bolotnikov, Mikhail F.; Neruchev, Yurij A., Enthalpies of vaporization of a series of the 1-iodoalkanes, Fluid Phase Equilibria, 2006, 243, 1-2, 121-125, https://doi.org/10.1016/j.fluid.2006.02.006 . [all data]

Dykyj and Vanko, 1970
Dykyj, J.; Vanko, A., Petrochemica, 1970, 10, 1, 3. [all data]