Decane, 2,5,9-trimethyl-

Phase change data

Data compiled by: Thermodynamics Research Center, NIST Boulder Laboratories, Chris Muzny director

Quantity Value Units Method Reference Comment
Tboil484.25KN/AKinney and Spliethoff, 1949Uncertainty assigned by TRC = 0.3 K

In addition to the Thermodynamics Research Center (TRC) data available from this site, much more physical and chemical property data is available from the following TRC products:

References

Kinney and Spliethoff, 1949
Kinney, C.R.; Spliethoff, W.L., A System of Correlating Molecular Structure of Organic Compounds with Boiling Points VII. New Boiling Pts. for Certain Paraffins and Olefins, J. Org. Chem., 1949, 14, 71. [all data]