1,3-di-p-tolylurea

Reaction thermochemistry data

Data compiled by: Hussein Y. Afeefy, Joel F. Liebman, and Stephen E. Stein

Individual Reactions

C15H16N2O = p-Aminotoluene + Benzene, 1-isocyanato-4-methyl-

By formula: C15H16N2O = C7H9N + C8H7NO

Quantity Value Units Method Reference Comment
Δr34.9 ± 0.2kcal/molEqkChimishkyan, Svetlova, et al., 1984solid phase; Dissociation

References

Chimishkyan, Svetlova, et al., 1984
Chimishkyan, A.L.; Svetlova, L.P.; Leonova, T.V.; Gluyaev, N.D., Thermal decomposition of substituted ureas, J. Gen. Chem. USSR, 1984, 54, 1317-1320. [all data]