1-Octyn-3-one, 1-phenyl-

Condensed phase thermochemistry data

Data compiled as indicated in comments:
DRB - Donald R. Burgess, Jr.
ALS - Hussein Y. Afeefy, Joel F. Liebman, and Stephen E. Stein

Quantity Value Units Method Reference Comment
Δfliquid-27.6 ± 1.7kcal/molCcbN/Arecalculated with modern CO2,H2O thermo; estimated uncertainty (NOTE all values in source also have wrong sign); DRB
Δfliquid41.0kcal/molCcbMoureu and Andre, 1914ALS
Quantity Value Units Method Reference Comment
Δcliquid-1835.6kcal/molCcbMoureu and Andre, 1914Corresponding Δfliquid = -27.6 kcal/mol (simple calculation by NIST; no Washburn corrections); ALS

References

Moureu and Andre, 1914
Moureu, C.; Andre, E., Thermochimie des composes acetyleniques, Ann. Chim. Phys., 1914, 1, 113-145. [all data]