1-Phenyloct-2-yn-1-ol

Condensed phase thermochemistry data

Data compiled as indicated in comments:
DRB - Donald R. Burgess, Jr.
ALS - Hussein Y. Afeefy, Joel F. Liebman, and Stephen E. Stein

Quantity Value Units Method Reference Comment
Δfliquid-28.1 ± 1.7kcal/molCcbN/Arecalculated with modern CO2,H2O thermo; estimated uncertainty (NOTE all values in source also have wrong sign); DRB
Δfliquid42.2kcal/molCcbMoureu and Andre, 1914ALS
Quantity Value Units Method Reference Comment
Δcliquid-1903.5kcal/molCcbMoureu and Andre, 1914Corresponding Δfliquid = -28.1 kcal/mol (simple calculation by NIST; no Washburn corrections); ALS

References

Moureu and Andre, 1914
Moureu, C.; Andre, E., Thermochimie des composes acetyleniques, Ann. Chim. Phys., 1914, 1, 113-145. [all data]