1-Chloroheptadecane

Phase change data

Data compiled by: William E. Acree, Jr., James S. Chickos

Quantity Value Units Method Reference Comment
Δvap103.6kJ/molN/ABolotnikov and Neruchev, 2006

Enthalpy of vaporization

ΔvapH (kJ/mol) Temperature (K) Method Reference Comment
73.2465.A,EStephenson and Malanowski, 1987Based on data from 450. - 673. K. See also Dykyj and Vanko, 1970 and Li and Rossini, 1961.

References

Bolotnikov and Neruchev, 2006
Bolotnikov, M.F.; Neruchev, Yu.A., The enthalpies of vaporization and intermolecular interaction energies of 1-chloroalkanes, Russ. J. Phys. Chem., 2006, 80, 8, 1191-1197, https://doi.org/10.1134/S0036024406080024 . [all data]

Stephenson and Malanowski, 1987
Stephenson, Richard M.; Malanowski, Stanislaw, Handbook of the Thermodynamics of Organic Compounds, 1987, https://doi.org/10.1007/978-94-009-3173-2 . [all data]

Dykyj and Vanko, 1970
Dykyj, J.; Vanko, A., Petrochemica, 1970, 10, 1, 3. [all data]

Li and Rossini, 1961
Li, J.C.M.; Rossini, F.D., Vapor Pressures and Boiling Points of the l-Fluoroalkanes, l-Chloroalkanes, l-Bromoalkanes, and l-Iodoalkanes, C 1 to C 20 ., J. Chem. Eng. Data, 1961, 6, 2, 268-270, https://doi.org/10.1021/je60010a025 . [all data]