cis-1,1,2,4-Tetramethylcyclopentane

Phase change data

Data compiled by: Thermodynamics Research Center, NIST Boulder Laboratories, Chris Muzny director

Quantity Value Units Method Reference Comment
Tfus154.24KN/AAnonymous, 1951Uncertainty assigned by TRC = 0.6 K; mixture of cis-trans isomers

In addition to the Thermodynamics Research Center (TRC) data available from this site, much more physical and chemical property data is available from the following TRC products:

Kovats' RI, non-polar column, isothermal

View large format table.

Column type Active phase Temperature (C) I Reference Comment
CapillarySqualane50.809.5Lunskii and Paizanskaya, 1988He; Column length: 50. m; Column diameter: 0.22 mm
CapillarySqualane70.815.3Lunskii and Paizanskaya, 1988He; Column length: 50. m; Column diameter: 0.22 mm
CapillaryVacuum Grease Oil (VM-4)35.805.Sidorov, Petrova, et al., 1972
CapillaryVacuum Grease Oil (VM-4)45.809.Sidorov, Petrova, et al., 1972
CapillaryVacuum Grease Oil (VM-4)50.810.Sidorov, Petrova, et al., 1972
CapillaryVacuum Grease Oil (VM-4)58.813.Sidorov, Petrova, et al., 1972
CapillaryVacuum Grease Oil (VM-4)68.816.Sidorov, Petrova, et al., 1972
PackedVacuum Grease Oil (VM-4)35.805.Sidorov, Ivanova, et al., 1971

References

Anonymous, 1951
Anonymous, R., , Sunbury Rep. No. 4199, Anglo-Iranian Oil Co., 1951. [all data]

Lunskii and Paizanskaya, 1988
Lunskii, M.Kh.; Paizanskaya, I.L., Identification of hydrocarbons C1-C9 of petrol fractions of oils and condensates in the use of capillary columns with dinonylphthalate, Zh. Anal. Khim., 1988, 43, 127-135. [all data]

Sidorov, Petrova, et al., 1972
Sidorov, R.I.; Petrova, V.I.; Ivanova, M.P., Qualitative analysis of wide-boiling fraction C5-C10 with capillary chromatography in Processes in chromatographic columns. Vol.17, 1972, 14-25. [all data]

Sidorov, Ivanova, et al., 1971
Sidorov, R.I.; Ivanova, M.P.; Petrova, V.I., Temperature dependence of cycloalkane's retention and its using in identification of structure, Gazovaya Khromatografiya, 1971, 15, 18-26. [all data]