2,4,7-Trimethyloctane

Phase change data

Data compiled by: William E. Acree, Jr., James S. Chickos

Enthalpy of vaporization

ΔvapH (kJ/mol) Temperature (K) Method Reference
47.6328.CMajer, Svoboda, et al., 1984
46.4343.CMajer, Svoboda, et al., 1984
45.3358.CMajer, Svoboda, et al., 1984

References

Majer, Svoboda, et al., 1984
Majer, V.; Svoboda, V.; Pechacek, J.; Hala, S., Enthalpies of vaporization and cohesive energies of eight C9 to C11, J. Chem. Thermodyn., 1984, 16, 567-572. [all data]