Hexane, 2-methyl-3-(1-methylethyl)-

Normal alkane RI, non-polar column, custom temperature program

Data compiled by: NIST Mass Spectrometry Data Center, William E. Wallace, director

Column type CapillaryCapillary
Active phase OV-101Polydimethyl siloxane
Column length (m)
Carrier gas
Substrate
Column diameter (mm)
Phase thickness (μm)
Program not specifiednot specified
I 915.916.
ReferenceDu and Liang, 2003Junkes, Castanho, et al., 2003
Comment MSDC-RI MSDC-RI

References

Du and Liang, 2003
Du, Y.; Liang, Y., Data mining for seeking accurate quantitative relationship between molecular structure and GC retention indices of alkanes by projection pursuit, Comput. Biol. Chem., 2003, 27, 3, 339-353, https://doi.org/10.1016/S1476-9271(02)00081-6 . [all data]

Junkes, Castanho, et al., 2003
Junkes, B.S.; Castanho, R.D.M.; Amboni, C.; Yunes, R.A.; Heinzen, V.E.F., Semiempirical Topological Index: A Novel Molecular Descriptor for Quantitative Structure-Retention Relationship Studies, Internet Electronic Journal of Molecular Design, 2003, 2, 1, 33-49. [all data]